{"text_format":"1","workbook":"xlsx","n_sheets":6,"sheets":["Wichtige Hinweise","Reisekostenabrechnung","Sonstige Kosten","Tagessätze","AP Auswahlwerte","Sonstige Kosten - Auswahl"],"not_rendered":{"charts":0,"images":2,"macros":1,"external_links":1,"defined_names":23,"comments":1,"pivot_tables":0},"unopened":[],"bounds":{"document_bytes":16777216,"sheet_cells":100000,"rows_first":2000,"rows_last":500,"rows_between":2000,"halvings":0,"cell_chars":16384,"cell_head_chars":4096},"cells_cut":0,"cells_raw":0,"read":"whole","date_system":"1900"}

{"sheet":"Wichtige Hinweise","index":0,"n_rows":52,"n_cols":2,"rows_kept":52,"cut":false,"hidden":false,"merged":[]}
["Hinweise zum Arbeiten mit der Muster-Reisekostenabrechnung"]
[]
[]
["1.","Für die Nutzung dieser Datei setzen wir Excel-Kenntnisse voraus, da u. U. an einigen Stellen Zellen eingefügt oder neu formatiert werden müssen, z. B. "]
[null,"wenn vorhandene  Zellen nicht ausreichen. Generell sind nur Zellen der in BLAUER SCHRIFT gekennzeichneten Spalten Eingabefelder."]
[]
["2.","Vor Nutzung der Reisekostenabrechnung sind in den Zeilen 1 bis 3 die Firmenbezeichnung, Abrechnungszeitraum und Name des Arbeitnehmers einzutragen. "]
[null,"Bitte benennen Sie in den Zeilen 5 und 6 unbedingt mittels der hinterlegten Drop-Down-Menüs Ihre innerbetrieblichen Regelungen zur Abrechnung der "]
[null,"Reisekosten bzw. Ihre Reisekosten-Richtlinien. "]
[]
["3.","In die Spalte F ist das Land einzugeben; bitte beachten Sie, dass wir ein Drop-Down-Menü zur Auswahl hinterlegt haben. Bei Besuch mehrerer Länder "]
[null,"an einem Tag ist der letzte Tätigkeitsort im Ausland maßgebend; bei Flügen Inland - Ausland zählt die Flugzeit zur Auslandszeit."]
[null,"Es werden die ab 1. Januar 2024 geltenden Pauschbeträge berücksichtigt."]
[null,"Für nicht erfasste Länder ist der für Luxemburg geltende Pauschbetrag maßgebend, für nicht erfasste Übersee- und Außengebiete eines Landes"]
[null,"ist der für das Mutterland geltende Pauschbetrag maßgebend."]
[]
["4.","In der Spalte L sind die gefahrenen Kilometer (hin und zurück) einzutragen. Die Reisekosten errechnen sich automatisch in Spalte M unter Berücksichtigung "]
[null,"der derzeit gültigen Kilometerpauschale von 0,30 Euro."]
[]
["5.","In den Spalten N, O und P sind zwingend diejenigen Mahlzeiten zu erfassen, die durch den Arbeitgeber gewährt wurden (z.B. bei Seminarbuchungen,"]
{"$rows_left_out":33}
{"sheet":"Reisekostenabrechnung","index":1,"n_rows":53,"n_cols":26,"rows_kept":53,"cut":false,"hidden":false,"merged":[[52,0,52,3],[7,6,7,7],[9,5,10,5],[7,10,9,10],[8,7,9,7],[39,0,39,6],[51,0,51,3],[50,0,50,1],[48,2,48,5],[8,4,9,4],[7,0,7,4],[0,0,0,24],[2,0,2,24],[1,0,1,24],[4,6,4,7],[4,0,4,5],[4,13,4,18],[4,19,4,24],[9,25,10,25],[10,23,10,24],[8,18,10,18],[8,16,10,16],[7,8,8,9],[9,8,10,8],[9,9,10,9],[7,16,7,20],[7,13,9,15],[8,19,10,19],[8,17,10,17],[8,20,10,20],[8,21,10,21],[8,22,10,22],[5,19,5,23],[5,13,5,18],[7,23,9,24],[47,2,47,5],[49,21,50,24],[40,21,40,24],[42,21,42,24],[43,21,43,24],[44,21,46,24],[47,21,48,24],[41,21,41,24],[39,21,39,24],[45,14,46,14],[44,19,46,20],[47,19,48,20],[49,19,50,20]]}
["Firmennamen und Anschrift eingeben"]
["Reisekostenabrechnung MM / 2024"]
["Arbeitnehmer: Name eingeben"]
[]
["Sollen Verpflegungspauschalen an den Arbeitnehmer gezahlt werden?",null,null,null,null,null,"JA",null,null,null,null,null,null,"Werden Kosten für veranlasste Mahlzeiten erstattet?  ",null,null,null,null,null,"BITTE AUSWÄHLEN"]
[null,null,null,null,null,null,null,null,null,null,null,null,null,"Wie erfolgt Versteuerung steuerpflichtiger Mahlzeiten?",null,null,null,null,null,"BITTE AUSWÄHLEN"]
[]
["Daten in jeder Spalte einzutragen (auch bei 1-tägiger Reise)",null,null,null,null,"Reiseziel","Verpflegungssatz",null,"Abwesenheit\n(nur für Berechnungszwecke)",null,"Verpfle-\ngungspau-\nschale","Gefahrene","Kilometer","Vom Arbeitgeber veranlasste Mahlzeiten: \nAnzahl bitte eintragen!\n",null,null,"Hotel-/Veranstaltungsrechnung",null,null,null,null,null,null,"Erstattung pauschaler Übernachtungs-\nkosten?\n"]
["Datum","Uhrzeit","Datum","Uhrzeit","Über-nachtung",null,null,"An-/Abreisetag\nund > 8 Std.",null,null,null,"Kilometer","pauschale",null,null,null,"Gesamt-\nbetrag\n(brutto)","Übernach-\ntungs-\nkosten","Rngs.-\nanteil f. Mahlzeiten\n/ pauschal, wenn inkl.","Sonstige \nHotel-\nkosten ","Private Kosten (nicht vom Arbeitgeber erstattbar)","Mahlzeiten \nKürzungs-\nbetrag VMA \n","Mahlzeiten \nVersteuerungsbetrag \nSachbezug\n"]
["Beginn","Beginn","Ende","Ende",null,"Land (eventuell auch Stadt)","ab 24 Std.",null,"Anzahl Tage\n> 24 Std.","Anzahl 8-24 Std.",null,null,"Kfz",null,null,null,null,null,null,null,null,null,null,null,null,"Anzahl Über-\nnachtungen"]
["TT.MM.JJ","hh,mm","TT.MM.JJ","hh,mm","JA / NEIN",null,"€","€",null,null,"€",null,{"$f":"IF($M$10='AP Auswahlwerte'!$A$12,'AP Auswahlwerte'!$B$12,IF(M10='AP Auswahlwerte'!$A$13,'AP Auswahlwerte'!$B$13,0))","v":0.3},"Früh-stück","Mittag-essen","Abend-essen",null,null,null,null,null,null,null,"JA / NEIN \n"]
[null,null,null,null,null,"Deutschland",{"$f":"VLOOKUP(F12,Tagessätze!A$4:D$237,2,FALSE)","v":28},{"$f":"VLOOKUP(F12,Tagessätze!A$4:D$237,3,FALSE)","v":14},{"$f":"IF(C12-A12>1,C12-A12-1,0)","v":0},{"$f":"IF(A12=\"\",0,IF(C12=A12,IF(D12-B12>8,1,0),IF(E12=\"JA\",2,IF(24-B12+D12>8,1,0))))","v":0},{"$f":"IF(A12=\"\",\"\",IF($G$5=\"BITTE AUSWÄHLEN\",\"Wahl fehlt\",IF($G$5=\"JA\",(G12*I12+H12*J12),0)))","v":""},null,{"$f":"L12*$M$11","v":0},null,null,null,{"$f":"SUM(R12:U12)","v":0},null,null,null,null,{"$f":"IF(A12=\"\",\"\",IF(Reisekostenabrechnung!$T$5=JA,\"Auswahl fehlt\",IF($T$5='AP Auswahlwerte'!$I$3,MIN(K12,(Reisekostenabrechnung!N12*0.2*Reisekostenabrechnung!$G12+Reisekostenabrechnung!O12*0.4*Reisekostenabrechnung!$G12+0.4*Reisekostenabrechnung!$G12*Reisekostenabrechnung!P12)),IF(S12='AP Auswahlwerte'!$P$2,IF(K12>0,MIN(K12,Reisekostenabrechnung!G12*(0.2*Reisekostenabrechnung!N12+0.4*Reisekostenabrechnung!O12+0.4*Reisekostenabrechnung!P12)),0),0))))","v":""},{"$f":"IF(A12=\"\",\"\",IF(K12=0,IF($T$5='AP Auswahlwerte'!$I$2,IF(S12<>\"PAUSCHAL\",0,(N12*'AP Auswahlwerte'!$D$3+'AP Auswahlwerte'!$D$4*Reisekostenabrechnung!O12+Reisekostenabrechnung!P12*'AP Auswahlwerte'!$D$5)),IF($T$5='AP Auswahlwerte'!$I$3,(N12*'AP Auswahlwerte'!$D$3+'AP Auswahlwerte'!$D$4*Reisekostenabrechnung!O12+Reisekostenabrechnung!P12*'AP Auswahlwerte'!$D$5),\"Auswahl fehlt\")),0))","v":""},{"$f":"IF(A12=C12,'AP Auswahlwerte'!$A$4,IF(R12>0,'AP Auswahlwerte'!$A$3,'AP Auswahlwerte'!$A$1))","v":"-"},{"$f":"(IF(C12-A12=0,0,IF(C12=\"\",0,IF(R12=0,IF(X12='AP Auswahlwerte'!$A$2,VLOOKUP(F12,Tagessätze!A$4:N$229,4,FALSE),0))*Z12)))","v":0},{"$f":"C12-A12","v":0}]
[null,null,null,null,null,"Deutschland",{"$f":"VLOOKUP(F13,Tagessätze!A$4:D$237,2,FALSE)","v":28},{"$f":"VLOOKUP(F13,Tagessätze!A$4:D$237,3,FALSE)","v":14},{"$f":"IF(C13-A13>1,C13-A13-1,0)","v":0},{"$f":"IF(A13=\"\",0,IF(C13=A13,IF(D13-B13>8,1,0),IF(E13=\"JA\",2,IF(24-B13+D13>8,1,0))))","v":0},"",null,0,null,null,null,0,null,null,null,null,{"$f":"IF(A13=\"\",\"\",IF(Reisekostenabrechnung!$T$5=JA,\"Auswahl fehlt\",IF($T$5='AP Auswahlwerte'!$I$3,MIN(K13,(Reisekostenabrechnung!N13*0.2*Reisekostenabrechnung!$G13+Reisekostenabrechnung!O13*0.4*Reisekostenabrechnung!$G13+0.4*Reisekostenabrechnung!$G13*Reisekostenabrechnung!P13)),IF(S13='AP Auswahlwerte'!$P$2,IF(K13>0,MIN(K13,Reisekostenabrechnung!G13*(0.2*Reisekostenabrechnung!N13+0.4*Reisekostenabrechnung!O13+0.4*Reisekostenabrechnung!P13)),0),0))))","v":""},{"$f":"IF(A13=\"\",\"\",IF(K13=0,IF($T$5='AP Auswahlwerte'!$I$2,IF(S13<>\"PAUSCHAL\",0,(N13*'AP Auswahlwerte'!$D$3+'AP Auswahlwerte'!$D$4*Reisekostenabrechnung!O13+Reisekostenabrechnung!P13*'AP Auswahlwerte'!$D$5)),IF($T$5='AP Auswahlwerte'!$I$3,(N13*'AP Auswahlwerte'!$D$3+'AP Auswahlwerte'!$D$4*Reisekostenabrechnung!O13+Reisekostenabrechnung!P13*'AP Auswahlwerte'!$D$5),\"Auswahl fehlt\")),0))","v":""},"-",{"$f":"(IF(C13-A13=0,0,IF(C13=\"\",0,IF(R13=0,IF(X13='AP Auswahlwerte'!$A$2,VLOOKUP(F13,Tagessätze!A$4:N$229,4,FALSE),0))*Z13)))","v":0},0]
[null,null,null,null,null,"Deutschland",{"$f":"VLOOKUP(F14,Tagessätze!A$4:D$237,2,FALSE)","v":28},{"$f":"VLOOKUP(F14,Tagessätze!A$4:D$237,3,FALSE)","v":14},0,0,"",null,0,null,null,null,0,null,null,null,null,{"$f":"IF(A14=\"\",\"\",IF(Reisekostenabrechnung!$T$5=JA,\"Auswahl fehlt\",IF($T$5='AP Auswahlwerte'!$I$3,MIN(K14,(Reisekostenabrechnung!N14*0.2*Reisekostenabrechnung!$G14+Reisekostenabrechnung!O14*0.4*Reisekostenabrechnung!$G14+0.4*Reisekostenabrechnung!$G14*Reisekostenabrechnung!P14)),IF(S14='AP Auswahlwerte'!$P$2,IF(K14>0,MIN(K14,Reisekostenabrechnung!G14*(0.2*Reisekostenabrechnung!N14+0.4*Reisekostenabrechnung!O14+0.4*Reisekostenabrechnung!P14)),0),0))))","v":""},{"$f":"IF(A14=\"\",\"\",IF(K14=0,IF($T$5='AP Auswahlwerte'!$I$2,IF(S14<>\"PAUSCHAL\",0,(N14*'AP Auswahlwerte'!$D$3+'AP Auswahlwerte'!$D$4*Reisekostenabrechnung!O14+Reisekostenabrechnung!P14*'AP Auswahlwerte'!$D$5)),IF($T$5='AP Auswahlwerte'!$I$3,(N14*'AP Auswahlwerte'!$D$3+'AP Auswahlwerte'!$D$4*Reisekostenabrechnung!O14+Reisekostenabrechnung!P14*'AP Auswahlwerte'!$D$5),\"Auswahl fehlt\")),0))","v":""},"-",{"$f":"(IF(C14-A14=0,0,IF(C14=\"\",0,IF(R14=0,IF(X14='AP Auswahlwerte'!$A$2,VLOOKUP(F14,Tagessätze!A$4:N$229,4,FALSE),0))*Z14)))","v":0},0]
[null,null,null,null,null,"Deutschland",{"$f":"VLOOKUP(F15,Tagessätze!A$4:D$237,2,FALSE)","v":28},{"$f":"VLOOKUP(F15,Tagessätze!A$4:D$237,3,FALSE)","v":14},0,0,"",null,0,null,null,null,0,null,null,null,null,{"$f":"IF(A15=\"\",\"\",IF(Reisekostenabrechnung!$T$5=JA,\"Auswahl fehlt\",IF($T$5='AP Auswahlwerte'!$I$3,MIN(K15,(Reisekostenabrechnung!N15*0.2*Reisekostenabrechnung!$G15+Reisekostenabrechnung!O15*0.4*Reisekostenabrechnung!$G15+0.4*Reisekostenabrechnung!$G15*Reisekostenabrechnung!P15)),IF(S15='AP Auswahlwerte'!$P$2,IF(K15>0,MIN(K15,Reisekostenabrechnung!G15*(0.2*Reisekostenabrechnung!N15+0.4*Reisekostenabrechnung!O15+0.4*Reisekostenabrechnung!P15)),0),0))))","v":""},{"$f":"IF(A15=\"\",\"\",IF(K15=0,IF($T$5='AP Auswahlwerte'!$I$2,IF(S15<>\"PAUSCHAL\",0,(N15*'AP Auswahlwerte'!$D$3+'AP Auswahlwerte'!$D$4*Reisekostenabrechnung!O15+Reisekostenabrechnung!P15*'AP Auswahlwerte'!$D$5)),IF($T$5='AP Auswahlwerte'!$I$3,(N15*'AP Auswahlwerte'!$D$3+'AP Auswahlwerte'!$D$4*Reisekostenabrechnung!O15+Reisekostenabrechnung!P15*'AP Auswahlwerte'!$D$5),\"Auswahl fehlt\")),0))","v":""},"-",{"$f":"(IF(C15-A15=0,0,IF(C15=\"\",0,IF(R15=0,IF(X15='AP Auswahlwerte'!$A$2,VLOOKUP(F15,Tagessätze!A$4:N$229,4,FALSE),0))*Z15)))","v":0},0]
[null,null,null,null,null,"Deutschland",{"$f":"VLOOKUP(F16,Tagessätze!A$4:D$237,2,FALSE)","v":28},{"$f":"VLOOKUP(F16,Tagessätze!A$4:D$237,3,FALSE)","v":14},0,0,"",null,0,null,null,null,0,null,null,null,null,{"$f":"IF(A16=\"\",\"\",IF(Reisekostenabrechnung!$T$5=JA,\"Auswahl fehlt\",IF($T$5='AP Auswahlwerte'!$I$3,MIN(K16,(Reisekostenabrechnung!N16*0.2*Reisekostenabrechnung!$G16+Reisekostenabrechnung!O16*0.4*Reisekostenabrechnung!$G16+0.4*Reisekostenabrechnung!$G16*Reisekostenabrechnung!P16)),IF(S16='AP Auswahlwerte'!$P$2,IF(K16>0,MIN(K16,Reisekostenabrechnung!G16*(0.2*Reisekostenabrechnung!N16+0.4*Reisekostenabrechnung!O16+0.4*Reisekostenabrechnung!P16)),0),0))))","v":""},{"$f":"IF(A16=\"\",\"\",IF(K16=0,IF($T$5='AP Auswahlwerte'!$I$2,IF(S16<>\"PAUSCHAL\",0,(N16*'AP Auswahlwerte'!$D$3+'AP Auswahlwerte'!$D$4*Reisekostenabrechnung!O16+Reisekostenabrechnung!P16*'AP Auswahlwerte'!$D$5)),IF($T$5='AP Auswahlwerte'!$I$3,(N16*'AP Auswahlwerte'!$D$3+'AP Auswahlwerte'!$D$4*Reisekostenabrechnung!O16+Reisekostenabrechnung!P16*'AP Auswahlwerte'!$D$5),\"Auswahl fehlt\")),0))","v":""},"-",{"$f":"(IF(C16-A16=0,0,IF(C16=\"\",0,IF(R16=0,IF(X16='AP Auswahlwerte'!$A$2,VLOOKUP(F16,Tagessätze!A$4:N$229,4,FALSE),0))*Z16)))","v":0},0]
[null,null,null,null,null,"Deutschland",{"$f":"VLOOKUP(F17,Tagessätze!A$4:D$237,2,FALSE)","v":28},{"$f":"VLOOKUP(F17,Tagessätze!A$4:D$237,3,FALSE)","v":14},0,0,"",null,0,null,null,null,0,null,null,null,null,{"$f":"IF(A17=\"\",\"\",IF(Reisekostenabrechnung!$T$5=JA,\"Auswahl fehlt\",IF($T$5='AP Auswahlwerte'!$I$3,MIN(K17,(Reisekostenabrechnung!N17*0.2*Reisekostenabrechnung!$G17+Reisekostenabrechnung!O17*0.4*Reisekostenabrechnung!$G17+0.4*Reisekostenabrechnung!$G17*Reisekostenabrechnung!P17)),IF(S17='AP Auswahlwerte'!$P$2,IF(K17>0,MIN(K17,Reisekostenabrechnung!G17*(0.2*Reisekostenabrechnung!N17+0.4*Reisekostenabrechnung!O17+0.4*Reisekostenabrechnung!P17)),0),0))))","v":""},{"$f":"IF(A17=\"\",\"\",IF(K17=0,IF($T$5='AP Auswahlwerte'!$I$2,IF(S17<>\"PAUSCHAL\",0,(N17*'AP Auswahlwerte'!$D$3+'AP Auswahlwerte'!$D$4*Reisekostenabrechnung!O17+Reisekostenabrechnung!P17*'AP Auswahlwerte'!$D$5)),IF($T$5='AP Auswahlwerte'!$I$3,(N17*'AP Auswahlwerte'!$D$3+'AP Auswahlwerte'!$D$4*Reisekostenabrechnung!O17+Reisekostenabrechnung!P17*'AP Auswahlwerte'!$D$5),\"Auswahl fehlt\")),0))","v":""},"-",{"$f":"(IF(C17-A17=0,0,IF(C17=\"\",0,IF(R17=0,IF(X17='AP Auswahlwerte'!$A$2,VLOOKUP(F17,Tagessätze!A$4:N$229,4,FALSE),0))*Z17)))","v":0},0]
[null,null,null,null,null,"Deutschland",{"$f":"VLOOKUP(F18,Tagessätze!A$4:D$237,2,FALSE)","v":28},{"$f":"VLOOKUP(F18,Tagessätze!A$4:D$237,3,FALSE)","v":14},0,0,"",null,0,null,null,null,0,null,null,null,null,{"$f":"IF(A18=\"\",\"\",IF(Reisekostenabrechnung!$T$5=JA,\"Auswahl fehlt\",IF($T$5='AP Auswahlwerte'!$I$3,MIN(K18,(Reisekostenabrechnung!N18*0.2*Reisekostenabrechnung!$G18+Reisekostenabrechnung!O18*0.4*Reisekostenabrechnung!$G18+0.4*Reisekostenabrechnung!$G18*Reisekostenabrechnung!P18)),IF(S18='AP Auswahlwerte'!$P$2,IF(K18>0,MIN(K18,Reisekostenabrechnung!G18*(0.2*Reisekostenabrechnung!N18+0.4*Reisekostenabrechnung!O18+0.4*Reisekostenabrechnung!P18)),0),0))))","v":""},{"$f":"IF(A18=\"\",\"\",IF(K18=0,IF($T$5='AP Auswahlwerte'!$I$2,IF(S18<>\"PAUSCHAL\",0,(N18*'AP Auswahlwerte'!$D$3+'AP Auswahlwerte'!$D$4*Reisekostenabrechnung!O18+Reisekostenabrechnung!P18*'AP Auswahlwerte'!$D$5)),IF($T$5='AP Auswahlwerte'!$I$3,(N18*'AP Auswahlwerte'!$D$3+'AP Auswahlwerte'!$D$4*Reisekostenabrechnung!O18+Reisekostenabrechnung!P18*'AP Auswahlwerte'!$D$5),\"Auswahl fehlt\")),0))","v":""},"-",{"$f":"(IF(C18-A18=0,0,IF(C18=\"\",0,IF(R18=0,IF(X18='AP Auswahlwerte'!$A$2,VLOOKUP(F18,Tagessätze!A$4:N$229,4,FALSE),0))*Z18)))","v":0},0]
[null,null,null,null,null,"Deutschland",{"$f":"VLOOKUP(F19,Tagessätze!A$4:D$237,2,FALSE)","v":28},{"$f":"VLOOKUP(F19,Tagessätze!A$4:D$237,3,FALSE)","v":14},0,0,"",null,0,null,null,null,{"$f":"SUM(R19:U19)","v":0},null,null,null,null,{"$f":"IF(A19=\"\",\"\",IF(Reisekostenabrechnung!$T$5=JA,\"Auswahl fehlt\",IF($T$5='AP Auswahlwerte'!$I$3,MIN(K19,(Reisekostenabrechnung!N19*0.2*Reisekostenabrechnung!$G19+Reisekostenabrechnung!O19*0.4*Reisekostenabrechnung!$G19+0.4*Reisekostenabrechnung!$G19*Reisekostenabrechnung!P19)),IF(S19='AP Auswahlwerte'!$P$2,IF(K19>0,MIN(K19,Reisekostenabrechnung!G19*(0.2*Reisekostenabrechnung!N19+0.4*Reisekostenabrechnung!O19+0.4*Reisekostenabrechnung!P19)),0),0))))","v":""},{"$f":"IF(A19=\"\",\"\",IF(K19=0,IF($T$5='AP Auswahlwerte'!$I$2,IF(S19<>\"PAUSCHAL\",0,(N19*'AP Auswahlwerte'!$D$3+'AP Auswahlwerte'!$D$4*Reisekostenabrechnung!O19+Reisekostenabrechnung!P19*'AP Auswahlwerte'!$D$5)),IF($T$5='AP Auswahlwerte'!$I$3,(N19*'AP Auswahlwerte'!$D$3+'AP Auswahlwerte'!$D$4*Reisekostenabrechnung!O19+Reisekostenabrechnung!P19*'AP Auswahlwerte'!$D$5),\"Auswahl fehlt\")),0))","v":""},"-",{"$f":"(IF(C19-A19=0,0,IF(C19=\"\",0,IF(R19=0,IF(X19='AP Auswahlwerte'!$A$2,VLOOKUP(F19,Tagessätze!A$4:N$229,4,FALSE),0))*Z19)))","v":0},0]
[null,null,null,null,null,"Deutschland",{"$f":"VLOOKUP(F20,Tagessätze!A$4:D$237,2,FALSE)","v":28},{"$f":"VLOOKUP(F20,Tagessätze!A$4:D$237,3,FALSE)","v":14},{"$f":"IF(C20-A20>1,C20-A20-1,0)","v":0},{"$f":"IF(A20=\"\",0,IF(C20=A20,IF(D20-B20>8,1,0),IF(E20=\"JA\",2,IF(24-B20+D20>8,1,0))))","v":0},{"$f":"IF(A20=\"\",\"\",IF($G$5=\"BITTE AUSWÄHLEN\",\"Wahl fehlt\",IF($G$5=\"JA\",(G20*I20+H20*J20),0)))","v":""},null,{"$f":"L20*$M$11","v":0},null,null,null,0,null,null,null,null,{"$f":"IF(A20=\"\",\"\",IF(Reisekostenabrechnung!$T$5=JA,\"Auswahl fehlt\",IF($T$5='AP Auswahlwerte'!$I$3,MIN(K20,(Reisekostenabrechnung!N20*0.2*Reisekostenabrechnung!$G20+Reisekostenabrechnung!O20*0.4*Reisekostenabrechnung!$G20+0.4*Reisekostenabrechnung!$G20*Reisekostenabrechnung!P20)),IF(S20='AP Auswahlwerte'!$P$2,IF(K20>0,MIN(K20,Reisekostenabrechnung!G20*(0.2*Reisekostenabrechnung!N20+0.4*Reisekostenabrechnung!O20+0.4*Reisekostenabrechnung!P20)),0),0))))","v":""},{"$f":"IF(A20=\"\",\"\",IF(K20=0,IF($T$5='AP Auswahlwerte'!$I$2,IF(S20<>\"PAUSCHAL\",0,(N20*'AP Auswahlwerte'!$D$3+'AP Auswahlwerte'!$D$4*Reisekostenabrechnung!O20+Reisekostenabrechnung!P20*'AP Auswahlwerte'!$D$5)),IF($T$5='AP Auswahlwerte'!$I$3,(N20*'AP Auswahlwerte'!$D$3+'AP Auswahlwerte'!$D$4*Reisekostenabrechnung!O20+Reisekostenabrechnung!P20*'AP Auswahlwerte'!$D$5),\"Auswahl fehlt\")),0))","v":""},"-",{"$f":"(IF(C20-A20=0,0,IF(C20=\"\",0,IF(R20=0,IF(X20='AP Auswahlwerte'!$A$2,VLOOKUP(F20,Tagessätze!A$4:N$229,4,FALSE),0))*Z20)))","v":0},0]
{"$rows_left_out":34}
{"sheet":"Sonstige Kosten","index":2,"n_rows":48,"n_cols":9,"rows_kept":48,"cut":false,"hidden":false,"merged":[[2,5,2,8],[0,0,0,3],[1,0,1,3],[2,0,2,3],[3,5,3,8],[0,5,1,8]]}
[{"$f":"Reisekostenabrechnung!A1","v":"Firmennamen und Anschrift eingeben"},null,null,null,null,"Achtung:"]
["Reisekostenabrechung"]
[{"$f":"Reisekostenabrechnung!A3","v":"Arbeitnehmer: Name eingeben"},null,null,null,null,"Nur von VTP"]
[null,null,null,null,null,"zu bearbeiten!"]
[null,null,null,null,null,"Betrag","VorSt-Schl.","KOST-","Konto"]
["Datum\nTT.MM.JJ","Beleg-\nnummer","Bezeichnung","Betrag",null," ","+ Konto #","Konto",0]
[null,null,null,null,null,{"$f":"D7","v":0},null,null,{"$f":"I6","v":0}]
[null,null,null,null,null,{"$f":"D8","v":0},null,null,{"$f":"I7","v":0}]
[null,null,null,null,null,0,null,null,0]
[null,null,null,null,null,0,null,null,0]
[null,null,null,null,null,0,null,null,0]
[null,null,null,null,null,0,null,null,0]
[null,null,null,null,null,0,null,null,0]
[null,null,null,null,null,0,null,null,0]
[null,null,null,null,null,0,null,null,0]
[null,null,null,null,null,0,null,null,0]
[null,null,null,null,null,0,null,null,0]
[null,null,null,null,null,0,null,null,0]
[null,null,null,null,null,0,null,null,0]
[null,null,null,null,null,0,null,null,0]
{"$rows_left_out":29}
{"sheet":"Tagessätze","index":3,"n_rows":237,"n_cols":6,"rows_kept":237,"cut":false,"hidden":true,"merged":[[0,0,2,0],[0,1,0,2],[0,3,1,3]]}
["Land"," Pauschbeträge  für Verpflegungsmehraufwendungen\nbei  einer Abwesenheitsdauer je Kalendertag von",null,"Pauschbetrag  für \nÜbernachtungskosten"]
[null,"mind. 24 Stunden","weniger als 24, \naber mind. 8 Stunden"]
[null,"EUR","EUR","EUR"]
["Deutschland",28,14,20,null,"Übersicht über die ab 1. Januar 2024 geltenden Pauschbeträge für"]
["Afghanistan",30,20,95,null,"Verpflegungsmehraufwendungen und Übernachtungskosten im Ausland"]
["Ägypten",50,33,112]
["Äthiopien",39,26,130,null,"BMF 21.11.2023"]
["Äquatorialguinea",42,28,166]
["Albanien",27,18,112]
["Algerien",47,32,120]
["Andorra",41,28,91]
["Angola",52,35,299]
["Antigua und Barbuda",66,44,203,null,"Pauschale Trinidad Tobago"]
["Argentinien",35,24,113]
["Armenien",24,16,59]
["Aserbaidschan",44,29,88]
["Australien - Canberra",74,49,186]
["Australien - Sydney",57,38,173]
["Australien - im Übrigen",57,38,173]
["Bahrain",48,32,153]
{"$rows_left_out":218}
{"sheet":"AP Auswahlwerte","index":4,"n_rows":13,"n_cols":18,"rows_kept":13,"cut":false,"hidden":true,"merged":[]}
["BITTE AUSWÄHLEN",null,"Sachbezugswerte 2014 (voraussichtlich)",null,"pauschale Kürzung Pauschale 24h",null,null,null,"BITTE AUSWÄHLEN",null,null,null,null,null,null,"OHNE Verpfleg.",null,"BITTE AUSWÄHLEN"]
["JA",null,null,null,"wenn fehlender Ausweis in Rechnung",null,null,null,"Arbeitnehmer werden tatsächliche Verpflegungskosten erstattet; bei Pauschalen erfolgt Kürzung 20%/40%/40% des VMA.",null,null,null,null,null,null,"PAUSCHAL",null,"Barzahlung / aus Kasse"]
["NEIN",null,"FRÜHSTÜCK",1.63,0.2,null,null,null,"Zahlung der steuerfreien Pauschale (mit prozentualer Kürzung für Mahlzeiten) ",null,null,null,null,null,null,"Betrag?",null,"Überweisung"]
["-",null,"MITTAGESSEN",3,0.4,null,null,null,null,null,null,null,null,null,null,null,null,"Lohn- / Gehaltsabrechnung"]
[null,null,"ABENDESSEN",3,0.4]
[]
["Übernachtungspauschale"]
[0,"Nein"]
[1,"JA",null,null,null,null,null,null,"BITTE AUSWÄHLEN"]
[null,null,null,null,null,null,null,null,"Entfällt (mangels Kosten, Erstattung oder steuerpfl. Mahlzeiten)"]
["Fahrzeug",null,null,null,null,null,null,null,"Individuelle Versteuerung des Sachbezugswertes durch AN"]
["Kfz",0.3,null,null,null,null,null,null,"Pauschale Versteuerung des Sachbezugswertes durch AG"]
["sonst.Motorisierung",0.2]

{"sheet":"Sonstige Kosten - Auswahl","index":5,"n_rows":17,"n_cols":1,"rows_kept":17,"cut":false,"hidden":true,"merged":[]}
["Parken"]
["Tanken"]
["Taxi"]
["Bewirtung Arbeitnehmer"]
["Bewirtung Geschäftsfreunde"]
["Bürobedarf"]
["EDV-Bedarf"]
["Geschenke bis 35 Euro"]
["Geschenke über 35 Euro"]
["Kfz-Reparatur"]
["Mautgebühren"]
["Porto"]
["Sonstige laufende Kfz-Kosten"]
["Sonstiges"]
[]
[]
["ausblenden"]